Reaction Details
Target5-hydroxytryptamine receptor 7
LigandBDBM50304005
Substrate/Competitorn/a
Meas. Tech.ChEMBL_595422 (CHEMBL1040063)
Ki>500±n/a nM
Citation de la Fuente, TMartín-Fontecha, MSallander, JBenhamú, BCampillo, MMedina, RAPellissier, LPClaeysen, SDumuis, APardo, LLópez-Rodríguez, ML Benzimidazole derivatives as new serotonin 5-HT6 receptor antagonists. Molecular mechanisms of receptor inactivation. J Med Chem53:1357-69 (2010) 
 
5-hydroxytryptamine receptor 7
Name:5-hydroxytryptamine receptor 7
Type:G Protein-Coupled Receptor (GPCR)
Mol. Mass.:53573.08
Organism:Homo sapiens (Human)
Description:P34969
Residue:479
BDBM50304005
NameBDBM50304005
Synonyms:2-(2-Naphthylmethyl)-5-piperazin-1-yl-1H-benzimidazole | CHEMBL566192
TypeSmall organic molecule
Emp. Form.C22H22N4
Mol. Mass.342.4369
SMILESC(c1nc2ccc(cc2[nH]1)N1CCNCC1)c1ccc2ccccc2c1