Reaction Details
Target5-hydroxytryptamine receptor 7
LigandBDBM50303997
Substrate/Competitorn/a
Meas. Tech.ChEMBL_595422 (CHEMBL1040063)
Ki>500±n/a nM
Citation de la Fuente, TMartín-Fontecha, MSallander, JBenhamú, BCampillo, MMedina, RAPellissier, LPClaeysen, SDumuis, APardo, LLópez-Rodríguez, ML Benzimidazole derivatives as new serotonin 5-HT6 receptor antagonists. Molecular mechanisms of receptor inactivation. J Med Chem53:1357-69 (2010) 
 
5-hydroxytryptamine receptor 7
Name:5-hydroxytryptamine receptor 7
Type:G Protein-Coupled Receptor (GPCR)
Mol. Mass.:53573.08
Organism:Homo sapiens (Human)
Description:P34969
Residue:479
BDBM50303997
NameBDBM50303997
Synonyms:2-Benzyl-4-(4-methylpiperazin-1-yl)-1H-benzimidazole | CHEMBL566410
TypeSmall organic molecule
Emp. Form.C19H22N4
Mol. Mass.306.4048
SMILESCN1CCN(CC1)c1cccc2[nH]c(Cc3ccccc3)nc12