Reaction Details
Target5-hydroxytryptamine receptor 7
LigandBDBM50303998
Substrate/Competitorn/a
Meas. Tech.ChEMBL_595422 (CHEMBL1040063)
Ki>500±n/a nM
Citation de la Fuente, TMartín-Fontecha, MSallander, JBenhamú, BCampillo, MMedina, RAPellissier, LPClaeysen, SDumuis, APardo, LLópez-Rodríguez, ML Benzimidazole derivatives as new serotonin 5-HT6 receptor antagonists. Molecular mechanisms of receptor inactivation. J Med Chem53:1357-69 (2010) 
 
5-hydroxytryptamine receptor 7
Name:5-hydroxytryptamine receptor 7
Type:G Protein-Coupled Receptor (GPCR)
Mol. Mass.:53573.08
Organism:Homo sapiens (Human)
Description:P34969
Residue:479
BDBM50303998
NameBDBM50303998
Synonyms:2-Benzyl-4-piperazin-1-yl-1H-benzimidazole | CHEMBL578411
TypeSmall organic molecule
Emp. Form.C18H20N4
Mol. Mass.292.3782
SMILESC(c1nc2c(cccc2[nH]1)N1CCNCC1)c1ccccc1