Reaction Details
Target5-hydroxytryptamine receptor 1B
LigandBDBM50160160
Substrate/Competitorn/a
Meas. Tech.ChEMBL_604267 (CHEMBL1066723)
Ki 100±n/a nM
Citation Legendre, OPecic, SChaudhary, SZimmerman, SMFantegrossi, WEHarding, WW Synthetic studies and pharmacological evaluations on the MDMA ('Ecstasy') antagonist nantenine. Bioorg Med Chem Lett20:628-31 (2010) 
 
5-hydroxytryptamine receptor 1B
Name:5-hydroxytryptamine receptor 1B
Type:G Protein-Coupled Receptor (GPCR)
Mol. Mass.:43579.17
Organism:Homo sapiens (Human)
Description:Receptor binding assays were performed using human clone stably expressed in CHO cells
Residue:390
BDBM50160160
NameBDBM50160160
Synonyms:(S)-1,2-Dimethoxy-6-methyl-5,6,6a,7-tetrahydro-4H-9,11-dioxa-6-aza-benzo[fg]cyclopenta[b]anthracene | CHEMBL179440
TypeSmall organic molecule
Emp. Form.C20H21NO4
Mol. Mass.339.385
SMILESCOc1cc2CCN(C)[C@H]3Cc4cc5OCOc5cc4-c(c1OC)c23