Reaction Details
TargetMu-type opioid receptor
LigandBDBM50160160
Substrate/Competitorn/a
Meas. Tech.ChEMBL_604296 (CHEMBL1066752)
Ki 7265±n/a nM
Citation Legendre, OPecic, SChaudhary, SZimmerman, SMFantegrossi, WEHarding, WW Synthetic studies and pharmacological evaluations on the MDMA ('Ecstasy') antagonist nantenine. Bioorg Med Chem Lett20:628-31 (2010) 
 
Mu-type opioid receptor
Name:Mu-type opioid receptor
Type:G Protein-Coupled Receptor (GPCR)
Mol. Mass.:44789.51
Organism:Homo sapiens (Human)
Description:P35372
Residue:400
BDBM50160160
NameBDBM50160160
Synonyms:(S)-1,2-Dimethoxy-6-methyl-5,6,6a,7-tetrahydro-4H-9,11-dioxa-6-aza-benzo[fg]cyclopenta[b]anthracene | CHEMBL179440
TypeSmall organic molecule
Emp. Form.C20H21NO4
Mol. Mass.339.385
SMILESCOc1cc2CCN(C)[C@H]3Cc4cc5OCOc5cc4-c(c1OC)c23