Reaction Details
Target5'-nucleotidase
LigandBDBM50268635
Substrate/Competitorn/a
Meas. Tech.ChEMBL_612633 (CHEMBL1065670)
Ki 47000±n/a nM
Citation Baqi, YLee, SYIqbal, JRipphausen, PLehr, AScheiff, ABZimmermann, HBajorath, JMüller, CE Development of potent and selective inhibitors of ecto-5'-nucleotidase based on an anthraquinone scaffold. J Med Chem53:2076-86 (2010) 
 
5'-nucleotidase
Name:5'-nucleotidase
Type:Enzyme
Mol. Mass.:63971.44
Organism:Rattus norvegicus (Rat)
Description:P21588
Residue:576
BDBM50268635
NameBDBM50268635
Synonyms:CHEMBL450832 | sodium 1-amino-4-(2-aminophenylamino)-9,10-dioxo-9,10-dihydroanthracene-2-sulfonate
TypeSmall organic molecule
Emp. Form.C20H14N3O5S
Mol. Mass.408.408
SMILESNc1ccccc1Nc1cc(c(N)c2C(=O)c3ccccc3C(=O)c12)S([O-])(=O)=O