Reaction Details
Target5'-nucleotidase
LigandBDBM50336785
Substrate/Competitorn/a
Meas. Tech.ChEMBL_612633 (CHEMBL1065670)
Ki 1660±n/a nM
Citation Baqi, YLee, SYIqbal, JRipphausen, PLehr, AScheiff, ABZimmermann, HBajorath, JMüller, CE Development of potent and selective inhibitors of ecto-5'-nucleotidase based on an anthraquinone scaffold. J Med Chem53:2076-86 (2010) 
 
5'-nucleotidase
Name:5'-nucleotidase
Type:Enzyme
Mol. Mass.:63971.44
Organism:Rattus norvegicus (Rat)
Description:P21588
Residue:576
BDBM50336785
NameBDBM50336785
Synonyms:CHEMBL606414 | sodium 1-amino-4-(cyclohexylamino)-9,10-dioxo-9,10-dihydroanthracene-2-sulfonate
TypeSmall organic molecule
Emp. Form.C20H19N2O5S
Mol. Mass.399.441
SMILESNc1c(cc(NC2CCCCC2)c2C(=O)c3ccccc3C(=O)c12)S([O-])(=O)=O