Reaction Details
TargetP2Y purinoceptor 4
LigandBDBM50268725
Substrate/Competitorn/a
Meas. Tech.ChEMBL_612834 (CHEMBL1067523)
IC50 2370±n/a nM
Citation Baqi, YLee, SYIqbal, JRipphausen, PLehr, AScheiff, ABZimmermann, HBajorath, JMüller, CE Development of potent and selective inhibitors of ecto-5'-nucleotidase based on an anthraquinone scaffold. J Med Chem53:2076-86 (2010) 
 
P2Y purinoceptor 4
Name:P2Y purinoceptor 4
Type:PROTEIN
Mol. Mass.:40977.17
Organism:Homo sapiens (Human)
Description:ChEMBL_751027
Residue:365
BDBM50268725
NameBDBM50268725
Synonyms:CHEMBL496030 | sodium 1-amino-4-(4-hydroxyphenylamino)-9,10-dioxo-9,10-dihydroanthracene-2-sulfonate
TypeSmall organic molecule
Emp. Form.C20H13N2O6S
Mol. Mass.409.393
SMILESNc1c(cc(Nc2ccc(O)cc2)c2C(=O)c3ccccc3C(=O)c12)S([O-])(=O)=O