Reaction Details
TargetSerine/threonine-protein kinase PLK1
LigandBDBM50307987
Substrate/Competitorn/a
Meas. Tech.ChEMBL_608420 (CHEMBL1064449)
IC50>10000±n/a nM
Citation Brasca, MGAlbanese, CAlzani, RAmici, RAvanzi, NBallinari, DBischoff, JBorghi, DCasale, ECroci, VFiorentini, FIsacchi, AMercurio, CNesi, MOrsini, PPastori, WPesenti, EPevarello, PRoussel, PVarasi, MVolpi, DVulpetti, ACiomei, M Optimization of 6,6-dimethyl pyrrolo[3,4-c]pyrazoles: Identification of PHA-793887, a potent CDK inhibitor suitable for intravenous dosing. Bioorg Med Chem18:1844-53 (2010) 
 
Serine/threonine-protein kinase PLK1
Name:Serine/threonine-protein kinase PLK1
Type:Serine/threonine-protein kinase
Mol. Mass.:68277.16
Organism:Homo sapiens (Human)
Description:P53350
Residue:603
BDBM50307987
NameBDBM50307987
Synonyms:CHEMBL604712 | N-[5-(2,2-Dimethylpropanoyl)-6,6-dimethyl-1,4,5,6-tetrahydropyrrolo[3,4-c]pyrazol-3-yl]-3,5-difluorobenzamide
TypeSmall organic molecule
Emp. Form.C19H22F2N4O2
Mol. Mass.376.4004
SMILESCC(C)(C)C(=O)N1Cc2c(NC(=O)c3cc(F)cc(F)c3)[nH]nc2C1(C)C