Reaction Details
TargetBeta-secretase 1
LigandBDBM50310152
Substrate/Competitorn/a
Meas. Tech.ChEMBL_612751 (CHEMBL1071577)
IC50 40±n/a nM
Citation Malamas, MSBarnes, KJohnson, MHui, YZhou, PTurner, JHu, YWagner, EFan, KChopra, ROlland, ABard, JPangalos, MReinhart, PRobichaud, AJ Di-substituted pyridinyl aminohydantoins as potent and highly selective human beta-secretase (BACE1) inhibitors. Bioorg Med Chem18:630-9 (2010) 
 
Beta-secretase 1
Name:Beta-secretase 1
Type:Protein
Mol. Mass.:55755.10
Organism:Homo sapiens (Human)
Description:P56817
Residue:501
BDBM50310152
NameBDBM50310152
Synonyms:CHEMBL597277 | rac-2-amino-4-(2,6-diethylpyridin-4-yl)-1-methyl-4-(3-(pyrimidin-5-yl)phenyl)-1H-imidazol-5(4H)-one
TypeSmall organic molecule
Emp. Form.C23H24N6O
Mol. Mass.400.4763
SMILESCCc1cc(cc(CC)n1)C1(N=C(N)N(C)C1=O)c1cccc(c1)-c1cncnc1