Reaction Details
TargetThymidine phosphorylase
LigandBDBM20079
Substrate/Competitorn/a
Meas. Tech.ChEMBL_607911 (CHEMBL1066239)
Ki 17±n/a nM
Citation Kocalka, PRejman, DVanek, VRinnová, MTomecková, IKrálíková, SPetrová, MPáv, OPohl, RBudesínský, MLiboska, RTocík, ZPanova, NVotruba, IRosenberg, I Structural diversity of nucleoside phosphonic acids as a key factor in the discovery of potent inhibitors of rat T-cell lymphoma thymidine phosphorylase. Bioorg Med Chem Lett20:862-5 (2010) 
 
Thymidine phosphorylase
Name:Thymidine phosphorylase
Type:Enzyme
Mol. Mass.:49948.87
Organism:Homo sapiens (Human)
Description:The recombinant human thymidine phosphorylase (V79TP) was expressed in V79 Chinese hamster cells (Sigma, T-9319).
Residue:482
BDBM20079
NameBDBM20079
Synonyms:5-chloro-6-[(2-iminopyrrolidin-1-yl)methyl]-1,2,3,4-tetrahydropyrimidine-2,4-dione CHEMBL65375 TPI | Tipiracil
TypeSmall organic molecule
Emp. Form.C9H11ClN4O2
Mol. Mass.242.662
SMILESClc1c(CN2CCCC2=N)[nH]c(=O)[nH]c1=O