Reaction Details
TargetThymidine phosphorylase
LigandBDBM50310203
Substrate/Competitorn/a
Meas. Tech.ChEMBL_607911 (CHEMBL1066239)
Ki 236±n/a nM
Citation Kocalka, PRejman, DVanek, VRinnová, MTomecková, IKrálíková, SPetrová, MPáv, OPohl, RBudesínský, MLiboska, RTocík, ZPanova, NVotruba, IRosenberg, I Structural diversity of nucleoside phosphonic acids as a key factor in the discovery of potent inhibitors of rat T-cell lymphoma thymidine phosphorylase. Bioorg Med Chem Lett20:862-5 (2010) 
 
Thymidine phosphorylase
Name:Thymidine phosphorylase
Type:Enzyme
Mol. Mass.:49948.87
Organism:Homo sapiens (Human)
Description:The recombinant human thymidine phosphorylase (V79TP) was expressed in V79 Chinese hamster cells (Sigma, T-9319).
Residue:482
BDBM50310203
NameBDBM50310203
Synonyms:8-(5-bromo-3-((2R,3R,4S,5R)-3,4-dihydroxy-5-(hydroxymethyl)tetrahydrofuran-2-yl)-2,6-dioxo-2,3-dihydropyrimidin-1(6H)-yl)octylphosphonic acid | CHEMBL597717
TypeSmall organic molecule
Emp. Form.C17H28BrN2O9P
Mol. Mass.515.29
SMILESOC[C@H]1O[C@H]([C@H](O)[C@@H]1O)n1cc(Br)c(=O)n(CCCCCCCCP(O)(O)=O)c1=O