Reaction Details
TargetC-C chemokine receptor type 5
LigandBDBM50312850
Substrate/Competitorn/a
Meas. Tech.ChEMBL_615873 (CHEMBL1102707)
IC50 6±n/a nM
Citation Lemoine, RCPetersen, ACSetti, LBaldinger, TWanner, JJekle, AHeilek, GdeRosier, AJi, CRotstein, DM Evaluation of a 3-amino-8-azabicyclo[3.2.1]octane replacement in the CCR5 antagonist maraviroc. Bioorg Med Chem Lett20:1674-6 (2010) 
 
C-C chemokine receptor type 5
Name:C-C chemokine receptor type 5
Type:Enzyme
Mol. Mass.:40540.21
Organism:Homo sapiens (Human)
Description:P51681
Residue:352
BDBM50312850
NameBDBM50312850
Synonyms:CHEMBL1082191 | Endo-N-((S)-3-(5-(3,5-dimethyl-4H-1,2,4-triazol-4-yl)hexahydrocyclopenta[c]pyrrol-2(1H)-yl)-1-(3-fluorophenyl)propyl)-3,3-difluorocyclobutanecarboxamide
TypeSmall organic molecule
Emp. Form.C25H32F3N5O
Mol. Mass.475.5497
SMILESCc1nnc(C)n1[C@H]1C[C@H]2CN(CC[C@H](NC(=O)C3CC(F)(F)C3)c3cccc(F)c3)C[C@H]2C1