Reaction Details
TargetReceptor-type tyrosine-protein kinase FLT3
LigandBDBM50304112
Substrate/Competitorn/a
Meas. Tech.ChEMBL_614228 (CHEMBL1106056)
IC50 128±n/a nM
Citation Choi, SJMoon, MJLee, SDChoi, SUHan, SYKim, YC Indirubin derivatives as potent FLT3 inhibitors with anti-proliferative activity of acute myeloid leukemic cells. Bioorg Med Chem Lett20:2033-7 (2010) 
 
Receptor-type tyrosine-protein kinase FLT3
Name:Receptor-type tyrosine-protein kinase FLT3
Type:Enzyme
Mol. Mass.:112888.62
Organism:Homo sapiens (Human)
Description:P36888
Residue:993
BDBM50304112
NameBDBM50304112
Synonyms:(Z)-5'-Amino-1H,1'H-[2,3']biindolylidene-3,2'-dione 3-oxime CHEMBL604263
TypeSmall organic molecule
Emp. Form.C16H12N4O2
Mol. Mass.292.2921
SMILESNc1ccc2NC(=O)C(c2c1)c1[nH]c2ccccc2c1N=O