Reaction Details
TargetReceptor-type tyrosine-protein kinase FLT3
LigandBDBM50313616
Substrate/Competitorn/a
Meas. Tech.ChEMBL_614228 (CHEMBL1106056)
IC50 10070±n/a nM
Citation Choi, SJMoon, MJLee, SDChoi, SUHan, SYKim, YC Indirubin derivatives as potent FLT3 inhibitors with anti-proliferative activity of acute myeloid leukemic cells. Bioorg Med Chem Lett20:2033-7 (2010) 
 
Receptor-type tyrosine-protein kinase FLT3
Name:Receptor-type tyrosine-protein kinase FLT3
Type:Enzyme
Mol. Mass.:112888.62
Organism:Homo sapiens (Human)
Description:P36888
Residue:993
BDBM50313616
NameBDBM50313616
Synonyms:5'-Fluoro-1H,1'H-[2,3']biindolylidene-3,2'-dione | CHEMBL1077286
TypeSmall organic molecule
Emp. Form.C16H9FN2O2
Mol. Mass.280.2533
SMILESFc1ccc2NC(=O)\C(=C3/Nc4ccccc4C3=O)c2c1