Reaction Details
TargetReceptor-type tyrosine-protein kinase FLT3
LigandBDBM50304116
Substrate/Competitorn/a
Meas. Tech.ChEMBL_614228 (CHEMBL1106056)
IC50>10000±n/a nM
Citation Choi, SJMoon, MJLee, SDChoi, SUHan, SYKim, YC Indirubin derivatives as potent FLT3 inhibitors with anti-proliferative activity of acute myeloid leukemic cells. Bioorg Med Chem Lett20:2033-7 (2010) 
 
Receptor-type tyrosine-protein kinase FLT3
Name:Receptor-type tyrosine-protein kinase FLT3
Type:Enzyme
Mol. Mass.:112888.62
Organism:Homo sapiens (Human)
Description:P36888
Residue:993
BDBM50304116
NameBDBM50304116
Synonyms:(Z)-5'-Nitro-1H,1'H-[2,3']biindolylidene-3,2'-dione CHEMBL593970
TypeSmall organic molecule
Emp. Form.C16H9N3O4
Mol. Mass.307.2604
SMILES[O-]c1c([nH]c2ccccc12)C1=c2cc(ccc2=[NH+]C1=O)[N+]([O-])=O