Reaction Details
TargetReceptor-type tyrosine-protein kinase FLT3
LigandBDBM50423773
Substrate/Competitorn/a
Meas. Tech.ChEMBL_614228 (CHEMBL1106056)
IC50 5.0±n/a nM
Citation Choi, SJMoon, MJLee, SDChoi, SUHan, SYKim, YC Indirubin derivatives as potent FLT3 inhibitors with anti-proliferative activity of acute myeloid leukemic cells. Bioorg Med Chem Lett20:2033-7 (2010) 
 
Receptor-type tyrosine-protein kinase FLT3
Name:Receptor-type tyrosine-protein kinase FLT3
Type:Enzyme
Mol. Mass.:112888.62
Organism:Homo sapiens (Human)
Description:P36888
Residue:993
BDBM50423773
NameBDBM50423773
Synonyms:A-1544750 KT-5555 SP924
TypeSmall organic molecule
Emp. Form.C26H21N3O4
Mol. Mass.439.4626
SMILESC[C@]12O[C@@H](C[C@@]1(O)CO)n1c3ccccc3c3c4C(=O)NCc4c4c5ccccc5n2c4c13