Reaction Details
TargetMu-type opioid receptor
LigandBDBM50314879
Substrate/Competitorn/a
Meas. Tech.ChEMBL_627502 (CHEMBL1112644)
Ki 420±n/a nM
Citation Weltrowska, GChung, NNLemieux, CGuo, JLu, YWilkes, BCSchiller, PW "Carba"-analogues of fentanyl are opioid receptor agonists. J Med Chem53:2875-81 (2010) 
 
Mu-type opioid receptor
Name:Mu-type opioid receptor
Type:G Protein-Coupled Receptor (GPCR)
Mol. Mass.:44789.51
Organism:Homo sapiens (Human)
Description:P35372
Residue:400
BDBM50314879
NameBDBM50314879
Synonyms:CHEMBL1091995 | N-formylnormorphine
TypeSmall organic molecule
Emp. Form.C17H17NO4
Mol. Mass.299.3212
SMILESO[C@H]1C=C[C@H]2[C@H]3Cc4ccc(O)c5O[C@@H]1[C@]2(CCN3C=O)c45