Reaction Details
TargetMu-type opioid receptor
LigandBDBM50314881
Substrate/Competitorn/a
Meas. Tech.ChEMBL_627497 (CHEMBL1111783)
Ki 224±n/a nM
Citation Weltrowska, GChung, NNLemieux, CGuo, JLu, YWilkes, BCSchiller, PW "Carba"-analogues of fentanyl are opioid receptor agonists. J Med Chem53:2875-81 (2010) 
 
Mu-type opioid receptor
Name:Mu-type opioid receptor
Type:G Protein-Coupled Receptor (GPCR)
Mol. Mass.:44503.11
Organism:Rattus norvegicus (rat)
Description:Competition binding assays were carried out using membrane preparations from transfected HN9.10 cells that constitutively expressed the mu opioid receptor.
Residue:398
BDBM50314881
NameBDBM50314881
Synonyms:CHEMBL1089543 cis-N-(3-(Guanidinomethyl)benzyl)-N-(4-phenylethylcyclohexyl)-propionamide
TypeSmall organic molecule
Emp. Form.C26H34N4O
Mol. Mass.418.5744
SMILES[#6]-[#6]-[#6](=O)-[#6](=[#6]-c1cccc(-[#6]\[#7]=[#6](\[#7])-[#7])c1)-[#6]-1-[#6]-[#6]-[#7](-[#6]-[#6]-c2ccccc2)-[#6]-[#6]-1