Reaction Details
TargetGeranylgeranyl pyrophosphate synthase
LigandBDBM50318032
Substrate/Competitorn/a
Meas. Tech.ChEMBL_631184 (CHEMBL1110033)
IC50>1000000±n/a nM
Citation McKenna, CEKashemirov, BABlazewska, KMMallard-Favier, IStewart, CARojas, JLundy, MWEbetino, FHBaron, RADunford, JEKirsten, MLSeabra, MCBala, JLMarma, MSRogers, MJCoxon, FP Synthesis, chiral high performance liquid chromatographic resolution and enantiospecific activity of a potent new geranylgeranyl transferase inhibitor, 2-hydroxy-3-imidazo[1,2-a]pyridin-3-yl-2-phosphonopropionic acid. J Med Chem53:3454-64 (2010) 
 
Geranylgeranyl pyrophosphate synthase
Name:Geranylgeranyl pyrophosphate synthase
Type:Homooctamer; transferase
Mol. Mass.:34867.94
Organism:Homo sapiens (Human)
Description:Recombinant human GGPPS was cloned and expressed in E. coli.
Residue:300
BDBM50318032
NameBDBM50318032
Synonyms:(+)-2-hydroxy-3-imidazo[1,2-a]pyridin-3-yl-2-phosphonopropionic acid (-)-2-hydroxy-3-imidazo[1,2-a]pyridin-3-yl-2-phosphonopropionic acid CHEMBL1099309
TypeSmall organic molecule
Emp. Form.C10H11N2O6P
Mol. Mass.286.1779
SMILESOC(=O)C(O)(Cc1cnc2ccccn12)P(O)(O)=O