Reaction Details
TargetFarnesyl pyrophosphate synthase
LigandBDBM50226002
Substrate/Competitorn/a
Meas. Tech.ChEMBL_631176 (CHEMBL1109110)
IC50>1000000±n/a nM
Citation McKenna, CEKashemirov, BABlazewska, KMMallard-Favier, IStewart, CARojas, JLundy, MWEbetino, FHBaron, RADunford, JEKirsten, MLSeabra, MCBala, JLMarma, MSRogers, MJCoxon, FP Synthesis, chiral high performance liquid chromatographic resolution and enantiospecific activity of a potent new geranylgeranyl transferase inhibitor, 2-hydroxy-3-imidazo[1,2-a]pyridin-3-yl-2-phosphonopropionic acid. J Med Chem53:3454-64 (2010) 
 
Farnesyl pyrophosphate synthase
Name:Farnesyl pyrophosphate synthase
Type:Enzyme
Mol. Mass.:48272.89
Organism:Homo sapiens (Human)
Description:P14324
Residue:419
BDBM50226002
NameBDBM50226002
Synonyms:(R)-2-hydroxy-2-phosphono-3-(pyridin-3-yl)propanoic acid 3-(3-Pyridyl)-2-hydroxy-2-phosphonopropanoic acid | CHEMBL397829
TypeSmall organic molecule
Emp. Form.C8H10NO6P
Mol. Mass.247.1419
SMILESOC(=O)C(O)(Cc1cccnc1)P(O)(O)=O