Reaction Details
TargetPotassium voltage-gated channel subfamily H member 2
LigandBDBM50318597
Substrate/Competitorn/a
Meas. Tech.ChEMBL_633190 (CHEMBL1118846)
IC50 2300±n/a nM
Citation Bavetsias, VLarge, JMSun, CBouloc, NKosmopoulou, MMatteucci, MWilsher, NEMartins, VReynisson, JAtrash, BFaisal, AUrban, FValenti, Mde Haven Brandon, ABox, GRaynaud, FIWorkman, PEccles, SABayliss, RBlagg, JLinardopoulos, SMcDonald, E Imidazo[4,5-b]pyridine derivatives as inhibitors of Aurora kinases: lead optimization studies toward the identification of an orally bioavailable preclinical development candidate. J Med Chem53:5213-28 (2010) 
 
Potassium voltage-gated channel subfamily H member 2
Name:Potassium voltage-gated channel subfamily H member 2
Type:Multi-pass membrane protein
Mol. Mass.:126672.65
Organism:Homo sapiens (Human)
Description:Q12809
Residue:1159
BDBM50318597
NameBDBM50318597
Synonyms:3-((4-(6-Chloro-2-(4-(4-methylpiperazin-1-yl)phenyl)-3H-imidazo[4,5-b]pyridin-7-yl)piperazin-1-yl)methyl)-5-methylisoxazole | CHEMBL1086582
TypeSmall organic molecule
Emp. Form.C20H27ClN8O
Mol. Mass.430.934
SMILESCN1CCN(CC1)c1nc2ncc(Cl)c(N3CCN(Cc4cc(C)on4)CC3)c2[nH]1