Reaction Details
TargetAurora kinase A
LigandBDBM50318577
Substrate/Competitorn/a
Meas. Tech.ChEMBL_633156 (CHEMBL1119040)
IC50 115±n/a nM
Citation Bavetsias, VLarge, JMSun, CBouloc, NKosmopoulou, MMatteucci, MWilsher, NEMartins, VReynisson, JAtrash, BFaisal, AUrban, FValenti, Mde Haven Brandon, ABox, GRaynaud, FIWorkman, PEccles, SABayliss, RBlagg, JLinardopoulos, SMcDonald, E Imidazo[4,5-b]pyridine derivatives as inhibitors of Aurora kinases: lead optimization studies toward the identification of an orally bioavailable preclinical development candidate. J Med Chem53:5213-28 (2010) 
 
Aurora kinase A
Name:Aurora kinase A
Type:Serine/threonine-protein kinase
Mol. Mass.:45830.98
Organism:Homo sapiens (Human)
Description:O14965
Residue:403
BDBM50318577
NameBDBM50318577
Synonyms:2-(4-(6-Chloro-2-(4-(dimethylamino)phenyl)-3H-imidazo[4,5-b]-pyridin-7-yl)piperazin-1-yl)-N-phenylacetamide | CHEMBL1083771
TypeSmall organic molecule
Emp. Form.C26H28ClN7O
Mol. Mass.490
SMILESCN(C)c1ccc(cc1)-c1nc2ncc(Cl)c(N3CCN(CC(=O)Nc4ccccc4)CC3)c2[nH]1