Reaction Details
TargetAurora kinase A
LigandBDBM50318610
Substrate/Competitorn/a
Meas. Tech.ChEMBL_633156 (CHEMBL1119040)
IC50 3±n/a nM
Citation Bavetsias, VLarge, JMSun, CBouloc, NKosmopoulou, MMatteucci, MWilsher, NEMartins, VReynisson, JAtrash, BFaisal, AUrban, FValenti, Mde Haven Brandon, ABox, GRaynaud, FIWorkman, PEccles, SABayliss, RBlagg, JLinardopoulos, SMcDonald, E Imidazo[4,5-b]pyridine derivatives as inhibitors of Aurora kinases: lead optimization studies toward the identification of an orally bioavailable preclinical development candidate. J Med Chem53:5213-28 (2010) 
 
Aurora kinase A
Name:Aurora kinase A
Type:Serine/threonine-protein kinase
Mol. Mass.:45830.98
Organism:Homo sapiens (Human)
Description:O14965
Residue:403
BDBM50318610
NameBDBM50318610
Synonyms:6-Bromo-7-[4-(5-methyl-isoxazol-3-ylmethyl)-piperazin-1-yl]-2-(4-pyrazol-1-ylmethyl-phenyl)-3H-imidazo[4,5-b]pyridine | CHEMBL1086583
TypeSmall organic molecule
Emp. Form.C23H29BrN10O
Mol. Mass.541.447
SMILESCc1cc(CN2CCN(CC2)c2c(Br)cnc3nc([nH]c23)N2CCN(Cn3cccn3)CC2)no1