Reaction Details
TargetDynamin-1
LigandBDBM50318676
Substrate/Competitorn/a
Meas. Tech.ChEMBL_633480 (CHEMBL1119292)
IC50 690000±n/a nM
Citation Odell, LRHowan, DGordon, CPRobertson, MJChau, NMariana, AWhiting, AEAbagyan, RDaniel, JAGorgani, NNRobinson, PJMcCluskey, A The pthaladyns: GTP competitive inhibitors of dynamin I and II GTPase derived from virtual screening. J Med Chem53:5267-80 (2010) 
 
Dynamin-1
Name:Dynamin-1
Type:PROTEIN
Mol. Mass.:97296.32
Organism:Rattus norvegicus
Description:ChEMBL_633480
Residue:864
BDBM50318676
NameBDBM50318676
Synonyms:4-Chloro-2-{[2-(4-hydroxymethylphenyl)-1,3-dioxo-2,3-dihydro-1H-isoindole-5-carbonyl]amino}benzoic Acid | CHEMBL1084521
TypeSmall organic molecule
Emp. Form.C23H15ClN2O6
Mol. Mass.450.828
SMILESOCc1ccc(cc1)N1C(=O)c2ccc(cc2C1=O)C(=O)Nc1cc(Cl)ccc1C(O)=O