Reaction Details
TargetDynamin-2
LigandBDBM50318677
Substrate/Competitorn/a
Meas. Tech.ChEMBL_633477 (CHEMBL1119289)
IC50 114000±n/a nM
Citation Odell, LRHowan, DGordon, CPRobertson, MJChau, NMariana, AWhiting, AEAbagyan, RDaniel, JAGorgani, NNRobinson, PJMcCluskey, A The pthaladyns: GTP competitive inhibitors of dynamin I and II GTPase derived from virtual screening. J Med Chem53:5267-80 (2010) 
 
Dynamin-2
Name:Dynamin-2
Type:PROTEIN
Mol. Mass.:98071.19
Organism:Homo sapiens (Human)
Description:ChEMBL_934670
Residue:870
BDBM50318677
NameBDBM50318677
Synonyms:4-Chloro-2-{[2-(4-hydroxyphenyl)-1,3-dioxo-2,3-dihydro-1Hisoindole-5-carbonyl]amino}benzoic Acid | CHEMBL1084248
TypeSmall organic molecule
Emp. Form.C22H13ClN2O6
Mol. Mass.436.801
SMILESOC(=O)c1ccc(Cl)cc1NC(=O)c1ccc2C(=O)N(C(=O)c2c1)c1ccc(O)cc1