Reaction Details
TargetDynamin-2
LigandBDBM50318675
Substrate/Competitorn/a
Meas. Tech.ChEMBL_633477 (CHEMBL1119289)
IC50 63000±n/a nM
Citation Odell, LRHowan, DGordon, CPRobertson, MJChau, NMariana, AWhiting, AEAbagyan, RDaniel, JAGorgani, NNRobinson, PJMcCluskey, A The pthaladyns: GTP competitive inhibitors of dynamin I and II GTPase derived from virtual screening. J Med Chem53:5267-80 (2010) 
 
Dynamin-2
Name:Dynamin-2
Type:PROTEIN
Mol. Mass.:98071.19
Organism:Homo sapiens (Human)
Description:ChEMBL_934670
Residue:870
BDBM50318675
NameBDBM50318675
Synonyms:4-Chloro-2-{[2-(3-nitrophenyl)-1,3-dioxo-2,3-dihydro-1H-isoindole-5-carbonyl]-amino}-benzoic Acid | CHEMBL1084249
TypeSmall organic molecule
Emp. Form.C22H12ClN3O7
Mol. Mass.465.8
SMILESOC(=O)c1ccc(Cl)cc1NC(=O)c1ccc2C(=O)N(C(=O)c2c1)c1cccc(c1)[N+]([O-])=O