Reaction Details
TargetUridine 5'-monophosphate synthase
LigandBDBM50378784
Substrate/Competitorn/a
Meas. Tech.ChEMBL_639005 (CHEMBL1168988)
Temperature298.15±n/a K
Ki 17±n/a nM
Commentsextracted
Citation Meza-Avina, MEWei, LLiu, YPoduch, EBello, AMMishra, RKPai, EFKotra, LP Structural determinants for the inhibitory ligands of orotidine-5'-monophosphate decarboxylase. Bioorg Med Chem18:4032-41 (2010) 
 
Uridine 5'-monophosphate synthase
Name:Uridine 5'-monophosphate synthase
Type:Enzyme
Mol. Mass.:52224.99
Organism:Homo sapiens (Human)
Description:P11172
Residue:480
BDBM50378784
NameBDBM50378784
Synonyms:CHEMBL1164953
TypeSmall organic molecule
Emp. Form.C9H14N3O9P
Mol. Mass.339.1959
SMILESNC(=O)c1[nH]nc([C@@H]2O[C@H](COP(O)(O)=O)[C@@H](O)[C@H]2O)c1O