Reaction Details
TargetHistamine H3 receptor
LigandBDBM50321491
Substrate/Competitorn/a
Meas. Tech.ChEMBL_640775 (CHEMBL1175767)
Ki 11±n/a nM
Citation Letavic, MAAluisio, LAtack, JRBonaventure, PCarruthers, NIDugovic, CEverson, AFeinstein, MAFraser, ICHoey, KJiang, XKeith, JMKoudriakova, TLeung, PLord, BLovenberg, TWLy, KSMorton, KLMotley, STNepomuceno, DRizzolio, MRynberg, RSepassi, KShelton, J Pre-clinical characterization of aryloxypyridine amides as histamine H3 receptor antagonists: identification of candidates for clinical development. Bioorg Med Chem Lett20:4210-4 (2010) 
 
Histamine H3 receptor
Name:Histamine H3 receptor
Type:G Protein-Coupled Receptor (GPCR)
Mol. Mass.:48691.47
Organism:Homo sapiens (Human)
Description:Binding assays were using CHO cells stably expressing hH3R receptors.
Residue:445
BDBM50321491
NameBDBM50321491
Synonyms:(4-cyclobutyl-1,4-diazepan-1-yl)(5-phenoxypyridin-3-yl)methanone | CHEMBL1169740
TypeSmall organic molecule
Emp. Form.C21H25N3O2
Mol. Mass.351.4421
SMILESO=C(N1CCCN(CC1)C1CCC1)c1cncc(Oc2ccccc2)c1