Reaction Details
TargetHistamine H3 receptor
LigandBDBM50321503
Substrate/Competitorn/a
Meas. Tech.ChEMBL_640775 (CHEMBL1175767)
Ki 1.5±n/a nM
Citation Letavic, MAAluisio, LAtack, JRBonaventure, PCarruthers, NIDugovic, CEverson, AFeinstein, MAFraser, ICHoey, KJiang, XKeith, JMKoudriakova, TLeung, PLord, BLovenberg, TWLy, KSMorton, KLMotley, STNepomuceno, DRizzolio, MRynberg, RSepassi, KShelton, J Pre-clinical characterization of aryloxypyridine amides as histamine H3 receptor antagonists: identification of candidates for clinical development. Bioorg Med Chem Lett20:4210-4 (2010) 
 
Histamine H3 receptor
Name:Histamine H3 receptor
Type:G Protein-Coupled Receptor (GPCR)
Mol. Mass.:48691.47
Organism:Homo sapiens (Human)
Description:Binding assays were using CHO cells stably expressing hH3R receptors.
Residue:445
BDBM50321503
NameBDBM50321503
Synonyms:(5-(3,4-dichlorophenoxy)pyridin-2-yl)(4-isopropyl-1,4-diazepan-1-yl)methanone | CHEMBL1172074
TypeSmall organic molecule
Emp. Form.C20H23Cl2N3O2
Mol. Mass.408.322
SMILESCC(C)N1CCCN(CC1)C(=O)c1ccc(Oc2ccc(Cl)c(Cl)c2)cn1