Reaction Details
TargetHistamine H4 receptor
LigandBDBM22542
Substrate/Competitorn/a
Meas. Tech.ChEMBL_643318 (CHEMBL1177489)
Ki 22±n/a nM
Citation Ishikawa, MFuruuchi, TYamauchi, MYokoyama, FKakui, NSato, Y Synthesis and structure-activity relationships of N-aryl-piperidine derivatives as potent (partial) agonists for human histamine H3 receptor. Bioorg Med Chem18:5441-8 (2010) 
 
Histamine H4 receptor
Name:Histamine H4 receptor
Type:G Protein-Coupled Receptor (GPCR)
Mol. Mass.:44517.02
Organism:Homo sapiens (Human)
Description:Binding assays were using CHO cells stably expressing hH4R receptors.
Residue:390
BDBM22542
NameBDBM22542
Synonyms:4-(1H-imidazol-4-ylmethyl)piperidine Immepip
TypeSmall organic molecule
Emp. Form.C9H15N3
Mol. Mass.165.2355
SMILESC(C1CCNCC1)c1cnc[nH]1