Reaction Details
TargetMast/stem cell growth factor receptor Kit
LigandBDBM50321892
Substrate/Competitorn/a
Meas. Tech.ChEMBL_642159 (CHEMBL1176710)
IC50 3.1±n/a nM
Citation Khanwelkar, RRChen, GSWang, HCYu, CWHuang, CHLee, OChen, CHHwang, CSKo, CHChou, NTLin, MWWang, LMChen, YCHseu, THChang, CNHsu, HCLin, HCShih, YCChou, SHTseng, HWLiu, CPTu, CMHu, TLTsai, YJChern, JW Synthesis and structure-activity relationship of 6-arylureido-3-pyrrol-2-ylmethylideneindolin-2-one derivatives as potent receptor tyrosine kinase inhibitors. Bioorg Med Chem18:4674-86 (2011) 
 
Mast/stem cell growth factor receptor Kit
Name:Mast/stem cell growth factor receptor Kit
Type:Protein
Mol. Mass.:109869.37
Organism:Homo sapiens (Human)
Description:P10721
Residue:976
BDBM50321892
NameBDBM50321892
Synonyms:(Z)-5-{6-[3-(4-Methoxyphenyl)-ureido]-2-oxo-1,2-dihydroindol-3-ylidene-methyl}-4-methyl-1H-pyrrole-3-carboxylic acid | CHEMBL1173411
TypeSmall organic molecule
Emp. Form.C23H20N4O5
Mol. Mass.432.4287
SMILESCOc1ccc(NC(=O)Nc2ccc3\C(=C\c4[nH]cc(C(O)=O)c4C)C(=O)Nc3c2)cc1