Reaction Details
TargetMast/stem cell growth factor receptor Kit
LigandBDBM50321909
Substrate/Competitorn/a
Meas. Tech.ChEMBL_642159 (CHEMBL1176710)
IC50 7.2±n/a nM
Citation Khanwelkar, RRChen, GSWang, HCYu, CWHuang, CHLee, OChen, CHHwang, CSKo, CHChou, NTLin, MWWang, LMChen, YCHseu, THChang, CNHsu, HCLin, HCShih, YCChou, SHTseng, HWLiu, CPTu, CMHu, TLTsai, YJChern, JW Synthesis and structure-activity relationship of 6-arylureido-3-pyrrol-2-ylmethylideneindolin-2-one derivatives as potent receptor tyrosine kinase inhibitors. Bioorg Med Chem18:4674-86 (2011) 
 
Mast/stem cell growth factor receptor Kit
Name:Mast/stem cell growth factor receptor Kit
Type:Protein
Mol. Mass.:109869.37
Organism:Homo sapiens (Human)
Description:P10721
Residue:976
BDBM50321909
NameBDBM50321909
Synonyms:(Z)-1-Biphenyl-4-yl-3-[2-oxo-3-(1H-pyrrol-2-ylmethylene)-2,3-dihydro-1H-indol-6-yl]urea | CHEMBL1172837
TypeSmall organic molecule
Emp. Form.C26H20N4O2
Mol. Mass.420.4626
SMILESO=C(Nc1ccc(cc1)-c1ccccc1)Nc1ccc2\C(=C\c3ccc[nH]3)C(=O)Nc2c1