Reaction Details
TargetReceptor-type tyrosine-protein kinase FLT3
LigandBDBM50321893
Substrate/Competitorn/a
Meas. Tech.ChEMBL_642158 (CHEMBL1176709)
IC50 2.3±n/a nM
Citation Khanwelkar, RRChen, GSWang, HCYu, CWHuang, CHLee, OChen, CHHwang, CSKo, CHChou, NTLin, MWWang, LMChen, YCHseu, THChang, CNHsu, HCLin, HCShih, YCChou, SHTseng, HWLiu, CPTu, CMHu, TLTsai, YJChern, JW Synthesis and structure-activity relationship of 6-arylureido-3-pyrrol-2-ylmethylideneindolin-2-one derivatives as potent receptor tyrosine kinase inhibitors. Bioorg Med Chem18:4674-86 (2011) 
 
Receptor-type tyrosine-protein kinase FLT3
Name:Receptor-type tyrosine-protein kinase FLT3
Type:Enzyme
Mol. Mass.:112888.62
Organism:Homo sapiens (Human)
Description:P36888
Residue:993
BDBM50321893
NameBDBM50321893
Synonyms:(Z)-1-[2-Oxo-3-(1H-pyrrol-2-ylmethylene)-2,3-dihydro-1H-indol-6-yl]-3-phenyl-urea | CHEMBL1173482
TypeSmall organic molecule
Emp. Form.C20H16N4O2
Mol. Mass.344.3666
SMILESO=C(Nc1ccccc1)Nc1ccc2\C(=C\c3ccc[nH]3)C(=O)Nc2c1