Reaction Details
TargetReceptor-type tyrosine-protein kinase FLT3
LigandBDBM50321905
Substrate/Competitorn/a
Meas. Tech.ChEMBL_642158 (CHEMBL1176709)
IC50 1.4±n/a nM
Citation Khanwelkar, RRChen, GSWang, HCYu, CWHuang, CHLee, OChen, CHHwang, CSKo, CHChou, NTLin, MWWang, LMChen, YCHseu, THChang, CNHsu, HCLin, HCShih, YCChou, SHTseng, HWLiu, CPTu, CMHu, TLTsai, YJChern, JW Synthesis and structure-activity relationship of 6-arylureido-3-pyrrol-2-ylmethylideneindolin-2-one derivatives as potent receptor tyrosine kinase inhibitors. Bioorg Med Chem18:4674-86 (2011) 
 
Receptor-type tyrosine-protein kinase FLT3
Name:Receptor-type tyrosine-protein kinase FLT3
Type:Enzyme
Mol. Mass.:112888.62
Organism:Homo sapiens (Human)
Description:P36888
Residue:993
BDBM50321905
NameBDBM50321905
Synonyms:(Z)-1-(4-Methoxyphenyl)-3-[2-oxo-3-(1H-pyrrol-2-ylmethylene)-2,3-dihydro-1H-indol-6-yl]urea | CHEMBL1173149
TypeSmall organic molecule
Emp. Form.C21H18N4O3
Mol. Mass.374.3926
SMILESCOc1ccc(NC(=O)Nc2ccc3\C(=C\c4ccc[nH]4)C(=O)Nc3c2)cc1