Reaction Details
TargetReceptor-type tyrosine-protein kinase FLT3
LigandBDBM50321894
Substrate/Competitorn/a
Meas. Tech.ChEMBL_642158 (CHEMBL1176709)
IC50 0.200000±n/a nM
Citation Khanwelkar, RRChen, GSWang, HCYu, CWHuang, CHLee, OChen, CHHwang, CSKo, CHChou, NTLin, MWWang, LMChen, YCHseu, THChang, CNHsu, HCLin, HCShih, YCChou, SHTseng, HWLiu, CPTu, CMHu, TLTsai, YJChern, JW Synthesis and structure-activity relationship of 6-arylureido-3-pyrrol-2-ylmethylideneindolin-2-one derivatives as potent receptor tyrosine kinase inhibitors. Bioorg Med Chem18:4674-86 (2011) 
 
Receptor-type tyrosine-protein kinase FLT3
Name:Receptor-type tyrosine-protein kinase FLT3
Type:Enzyme
Mol. Mass.:112888.62
Organism:Homo sapiens (Human)
Description:P36888
Residue:993
BDBM50321894
NameBDBM50321894
Synonyms:(Z)-2,4-Dimethyl-5-[2-oxo-6-(3-phenylureido)-1,2-dihydroindol-3-ylidene-methyl]-1H-pyrrole-3-carboxylic acid | CHEMBL1173107
TypeSmall organic molecule
Emp. Form.C23H20N4O4
Mol. Mass.416.4293
SMILESCc1[nH]c(\C=C2/C(=O)Nc3cc(NC(=O)Nc4ccccc4)ccc23)c(C)c1C(O)=O