Reaction Details
TargetReceptor-type tyrosine-protein kinase FLT3
LigandBDBM50321900
Substrate/Competitorn/a
Meas. Tech.ChEMBL_642158 (CHEMBL1176709)
IC50 2.7±n/a nM
Citation Khanwelkar, RRChen, GSWang, HCYu, CWHuang, CHLee, OChen, CHHwang, CSKo, CHChou, NTLin, MWWang, LMChen, YCHseu, THChang, CNHsu, HCLin, HCShih, YCChou, SHTseng, HWLiu, CPTu, CMHu, TLTsai, YJChern, JW Synthesis and structure-activity relationship of 6-arylureido-3-pyrrol-2-ylmethylideneindolin-2-one derivatives as potent receptor tyrosine kinase inhibitors. Bioorg Med Chem18:4674-86 (2011) 
 
Receptor-type tyrosine-protein kinase FLT3
Name:Receptor-type tyrosine-protein kinase FLT3
Type:Enzyme
Mol. Mass.:112888.62
Organism:Homo sapiens (Human)
Description:P36888
Residue:993
BDBM50321900
NameBDBM50321900
Synonyms:(Z)-3-(5-{6-[3-(4-Methoxyphenyl)-ureido]-2-oxo-1,2-dihydroindol-3-ylidene-methyl}-2,4-dimethyl-1H-pyrrol-3-yl)propionic acid | CHEMBL1173541
TypeSmall organic molecule
Emp. Form.C26H26N4O5
Mol. Mass.474.5084
SMILESCOc1ccc(NC(=O)Nc2ccc3\C(=C\c4[nH]c(C)c(CCC(O)=O)c4C)C(=O)Nc3c2)cc1