Reaction Details
TargetAromatase
LigandBDBM50322058
Substrate/Competitorn/a
Meas. Tech.ChEMBL_642469 (CHEMBL1175842)
IC50 3080±n/a nM
Citation Sun, BHoshino, JJermihov, KMarler, LPezzuto, JMMesecar, ADCushman, M Design, synthesis, and biological evaluation of resveratrol analogues as aromatase and quinone reductase 2 inhibitors for chemoprevention of cancer. Bioorg Med Chem18:5352-66 (2010) 
 
Aromatase
Name:Aromatase
Type:Enzyme
Mol. Mass.:57888.92
Organism:Homo sapiens (Human)
Description:P11511
Residue:503
BDBM50322058
NameBDBM50322058
Synonyms:3-Methoxyl-4'-amino-trans-stilbene | CHEMBL1173573
TypeSmall organic molecule
Emp. Form.C15H15NO
Mol. Mass.225.2857
SMILESCOc1cccc(\C=C\c2ccc(N)cc2)c1