Reaction Details
TargetAromatase
LigandBDBM50322063
Substrate/Competitorn/a
Meas. Tech.ChEMBL_642469 (CHEMBL1175842)
IC50 7470±n/a nM
Citation Sun, BHoshino, JJermihov, KMarler, LPezzuto, JMMesecar, ADCushman, M Design, synthesis, and biological evaluation of resveratrol analogues as aromatase and quinone reductase 2 inhibitors for chemoprevention of cancer. Bioorg Med Chem18:5352-66 (2010) 
 
Aromatase
Name:Aromatase
Type:Enzyme
Mol. Mass.:57888.92
Organism:Homo sapiens (Human)
Description:P11511
Residue:503
BDBM50322063
NameBDBM50322063
Synonyms:3-Amino-4'-amino-trans-stilbene | CHEMBL1171628
TypeSmall organic molecule
Emp. Form.C14H14N2
Mol. Mass.210.2744
SMILESNc1ccc(\C=C\c2cccc(N)c2)cc1