Reaction Details
TargetAromatase
LigandBDBM50322066
Substrate/Competitorn/a
Meas. Tech.ChEMBL_642469 (CHEMBL1175842)
IC50 5000±n/a nM
Citation Sun, BHoshino, JJermihov, KMarler, LPezzuto, JMMesecar, ADCushman, M Design, synthesis, and biological evaluation of resveratrol analogues as aromatase and quinone reductase 2 inhibitors for chemoprevention of cancer. Bioorg Med Chem18:5352-66 (2010) 
 
Aromatase
Name:Aromatase
Type:Enzyme
Mol. Mass.:57888.92
Organism:Homo sapiens (Human)
Description:P11511
Residue:503
BDBM50322066
NameBDBM50322066
Synonyms:3,5-Dihydroxyl-4'-amino-trans-stilbene Stilbene derivative, 3
TypeSmall organic molecule
Emp. Form.C14H13NO2
Mol. Mass.227.2585
SMILESNc1ccc(\C=C\c2cc(O)cc(O)c2)cc1