Reaction Details
TargetAromatase
LigandBDBM50322067
Substrate/Competitorn/a
Meas. Tech.ChEMBL_642469 (CHEMBL1175842)
IC50 1840±n/a nM
Citation Sun, BHoshino, JJermihov, KMarler, LPezzuto, JMMesecar, ADCushman, M Design, synthesis, and biological evaluation of resveratrol analogues as aromatase and quinone reductase 2 inhibitors for chemoprevention of cancer. Bioorg Med Chem18:5352-66 (2010) 
 
Aromatase
Name:Aromatase
Type:Enzyme
Mol. Mass.:57888.92
Organism:Homo sapiens (Human)
Description:P11511
Residue:503
BDBM50322067
NameBDBM50322067
Synonyms:1-(4-Amino-phenyl)-2-imidazol-1-yl-ethanone CHEMBL162431
TypeSmall organic molecule
Emp. Form.C11H11N3O
Mol. Mass.201.2245
SMILESNc1ccc(cc1)C(=O)Cn1ccnc1