Reaction Details
TargetPotassium voltage-gated channel subfamily H member 2
LigandBDBM50322425
Substrate/Competitorn/a
Meas. Tech.ChEMBL_643226 (CHEMBL1177037)
IC50 3300±n/a nM
Citation Pinard, EAlanine, AAlberati, DBender, MBorroni, EBourdeaux, PBrom, VBurner, SFischer, HHainzl, DHalm, RHauser, NJolidon, SLengyel, JMarty, HPMeyer, TMoreau, JLMory, RNarquizian, RNettekoven, MNorcross, RDPuellmann, BSchmid, PSchmitt, SStalder, HWermuth, RWettstein, JGZimmerli, D Selective GlyT1 inhibitors: discovery of [4-(3-fluoro-5-trifluoromethylpyridin-2-yl)piperazin-1-yl][5-methanesulfonyl-2-((S)-2,2,2-trifluoro-1-methylethoxy)phenyl]methanone (RG1678), a promising novel medicine to treat schizophrenia. J Med Chem53:4603-14 (2010) 
 
Potassium voltage-gated channel subfamily H member 2
Name:Potassium voltage-gated channel subfamily H member 2
Type:Multi-pass membrane protein
Mol. Mass.:126672.65
Organism:Homo sapiens (Human)
Description:Q12809
Residue:1159
BDBM50322425
NameBDBM50322425
Synonyms:3-Fluoro-4-[4-(2-isopropoxy-5-methanesulfonyl-benzoyl)-piperazin-1-yl]-benzonitrile | CHEMBL1173635
TypeSmall organic molecule
Emp. Form.C22H24FN3O4S
Mol. Mass.445.507
SMILESCC(C)Oc1ccc(cc1C(=O)N1CCN(CC1)c1ccc(cc1F)C#N)S(C)(=O)=O