Reaction Details
TargetPotassium voltage-gated channel subfamily H member 2
LigandBDBM50322426
Substrate/Competitorn/a
Meas. Tech.ChEMBL_643226 (CHEMBL1177037)
IC50 2000±n/a nM
Citation Pinard, EAlanine, AAlberati, DBender, MBorroni, EBourdeaux, PBrom, VBurner, SFischer, HHainzl, DHalm, RHauser, NJolidon, SLengyel, JMarty, HPMeyer, TMoreau, JLMory, RNarquizian, RNettekoven, MNorcross, RDPuellmann, BSchmid, PSchmitt, SStalder, HWermuth, RWettstein, JGZimmerli, D Selective GlyT1 inhibitors: discovery of [4-(3-fluoro-5-trifluoromethylpyridin-2-yl)piperazin-1-yl][5-methanesulfonyl-2-((S)-2,2,2-trifluoro-1-methylethoxy)phenyl]methanone (RG1678), a promising novel medicine to treat schizophrenia. J Med Chem53:4603-14 (2010) 
 
Potassium voltage-gated channel subfamily H member 2
Name:Potassium voltage-gated channel subfamily H member 2
Type:Multi-pass membrane protein
Mol. Mass.:126672.65
Organism:Homo sapiens (Human)
Description:Q12809
Residue:1159
BDBM50322426
NameBDBM50322426
Synonyms:3-Fluoro-4-{4-[5-methanesulfonyl-2-(2,2,2-trifluoro-ethoxy)-benzoyl]-piperazin-1-yl}-benzonitrile | CHEMBL1172998
TypeSmall organic molecule
Emp. Form.C21H19F4N3O4S
Mol. Mass.485.452
SMILESCS(=O)(=O)c1ccc(OCC(F)(F)F)c(c1)C(=O)N1CCN(CC1)c1ccc(cc1F)C#N