Reaction Details
TargetNeuronal acetylcholine receptor subunit alpha-7
LigandBDBM82070
Substrate/Competitorn/a
Meas. Tech.ChEMBL_645075 (CHEMBL1211581)
Ki 2110±n/a nM
Citation Lowe, JADeNinno, SLCoe, JWZhang, LMente, SHurst, RSMather, RJWard, KMShrikhande, ARollema, HJohnson, DEHorner, WGorczyca, RTingley, FDKozak, RMajchrzak, MJTritto, TSadlier, JShaffer, CLEllerbrock, BOsgood, SMMacDougall, MCMcDowell, LL A novel series of [3.2.1] azabicyclic biaryl ethers as alpha3beta4 and alpha6/4beta4 nicotinic receptor agonists. Bioorg Med Chem Lett20:4749-52 (2010) 
 
Neuronal acetylcholine receptor subunit alpha-7
Name:Neuronal acetylcholine receptor subunit alpha-7
Type:n/a
Mol. Mass.:56448.33
Organism:Homo sapiens (Human)
Description: CHRNA7 (NACHRA7)
Residue:502
BDBM82070
NameBDBM82070
Synonyms:CAS_29790-52-1 Nicotine-D salicylate US9303017, Nicotine
Typen/a
Emp. Form.C10H14N2
Mol. Mass.162.2316
SMILESCN1CCC[C@H]1c1cccnc1