Reaction Details
TargetPotassium voltage-gated channel subfamily H member 2
LigandBDBM50323672
Substrate/Competitorn/a
Meas. Tech.ChEMBL_645081 (CHEMBL1211587)
Ki 1580±n/a nM
Citation Lowe, JADeNinno, SLCoe, JWZhang, LMente, SHurst, RSMather, RJWard, KMShrikhande, ARollema, HJohnson, DEHorner, WGorczyca, RTingley, FDKozak, RMajchrzak, MJTritto, TSadlier, JShaffer, CLEllerbrock, BOsgood, SMMacDougall, MCMcDowell, LL A novel series of [3.2.1] azabicyclic biaryl ethers as alpha3beta4 and alpha6/4beta4 nicotinic receptor agonists. Bioorg Med Chem Lett20:4749-52 (2010) 
 
Potassium voltage-gated channel subfamily H member 2
Name:Potassium voltage-gated channel subfamily H member 2
Type:Multi-pass membrane protein
Mol. Mass.:126672.65
Organism:Homo sapiens (Human)
Description:Q12809
Residue:1159
BDBM50323672
NameBDBM50323672
Synonyms:(1R,6S,5R)-[6-(2-(5-Hydroxypyridin-3-yl)phenoxy))]-3-azabicyclo[3.2.1]octane hydrochloride rac-exo-[6-(2-(5-Hydroxypyridin-3-yl)phenoxy))]-3-azabicyclo[3.2.1]octane
TypeSmall organic molecule
Emp. Form.C18H20N2O2
Mol. Mass.296.3636
SMILESOc1cncc(c1)-c1ccccc1O[C@H]1C[C@H]2C[C@@H]1CNC2