Reaction Details
TargetNeuronal acetylcholine receptor subunit alpha-7
LigandBDBM50323672
Substrate/Competitorn/a
Meas. Tech.ChEMBL_645075 (CHEMBL1211581)
Ki>13500±n/a nM
Citation Lowe, JADeNinno, SLCoe, JWZhang, LMente, SHurst, RSMather, RJWard, KMShrikhande, ARollema, HJohnson, DEHorner, WGorczyca, RTingley, FDKozak, RMajchrzak, MJTritto, TSadlier, JShaffer, CLEllerbrock, BOsgood, SMMacDougall, MCMcDowell, LL A novel series of [3.2.1] azabicyclic biaryl ethers as alpha3beta4 and alpha6/4beta4 nicotinic receptor agonists. Bioorg Med Chem Lett20:4749-52 (2010) 
 
Neuronal acetylcholine receptor subunit alpha-7
Name:Neuronal acetylcholine receptor subunit alpha-7
Type:n/a
Mol. Mass.:56448.33
Organism:Homo sapiens (Human)
Description: CHRNA7 (NACHRA7)
Residue:502
BDBM50323672
NameBDBM50323672
Synonyms:(1R,6S,5R)-[6-(2-(5-Hydroxypyridin-3-yl)phenoxy))]-3-azabicyclo[3.2.1]octane hydrochloride rac-exo-[6-(2-(5-Hydroxypyridin-3-yl)phenoxy))]-3-azabicyclo[3.2.1]octane
TypeSmall organic molecule
Emp. Form.C18H20N2O2
Mol. Mass.296.3636
SMILESOc1cncc(c1)-c1ccccc1O[C@H]1C[C@H]2C[C@@H]1CNC2