Reaction Details
TargetNeuronal acetylcholine receptor subunit alpha-4/beta-2
LigandBDBM50323669
Substrate/Competitorn/a
Meas. Tech.ChEMBL_645071 (CHEMBL1211577)
Ki>1300±n/a nM
Citation Lowe, JADeNinno, SLCoe, JWZhang, LMente, SHurst, RSMather, RJWard, KMShrikhande, ARollema, HJohnson, DEHorner, WGorczyca, RTingley, FDKozak, RMajchrzak, MJTritto, TSadlier, JShaffer, CLEllerbrock, BOsgood, SMMacDougall, MCMcDowell, LL A novel series of [3.2.1] azabicyclic biaryl ethers as alpha3beta4 and alpha6/4beta4 nicotinic receptor agonists. Bioorg Med Chem Lett20:4749-52 (2010) 
 
Neuronal acetylcholine receptor subunit alpha-4/beta-2
Name:Neuronal acetylcholine receptor subunit alpha-4/beta-2
Type:Protein
Mol. Mass.:n/a
Description:n/a
Components:This complex has 2 components.
Component 1
Name:Neuronal acetylcholine receptor subunit alpha-4
Synonyms:ACHA4_HUMAN CHRNA4 protein Neuronal acetylcholine receptor protein alpha-4 subunit Nicotinic acetylcholine receptor alpha4/beta2/alpha5
Type:n/a
Mol. Mass.:69963.49
Organism:Homo sapiens (Human)
Description:NACHRA4
Residue:627
Component 2
Name:Neuronal acetylcholine receptor subunit beta-2
Synonyms:ACHB2_HUMAN Neuronal acetylcholine receptor protein beta-2 subunit | Nicotinic acetylcholine receptor alpha3/beta2/alpha5
Type:Protein
Mol. Mass.:57020.50
Organism:Homo sapiens (Human)
Description:P17787
Residue:502
BDBM50323669
NameBDBM50323669
Synonyms:(1R,6S,5R)-[6-(2-(Pyridin-3-yl)phenoxy))]-3-azabicyclo[3.2.1]octane hydrochloride rac-exo-[6-(2-(pyridin-3-yl)phenoxy))]-3-azabicyclo[3.2.1]octane hydrochloride
TypeSmall organic molecule
Emp. Form.C18H20N2O
Mol. Mass.280.3642
SMILESC1[C@@H]2C[C@H](Oc3ccccc3-c3cccnc3)[C@H]1CNC2