Reaction Details
TargetKappa-type opioid receptor
LigandBDBM50326658
Substrate/Competitorn/a
Meas. Tech.ChEMBL_662060 (CHEMBL1251870)
Ki 33.1±n/a nM
Citation Schuster, DSpetea, MMusic, MRief, SFink, MKirchmair, JSchütz, JWolber, GLanger, TStuppner, HSchmidhammer, HRollinger, JM Morphinans and isoquinolines: acetylcholinesterase inhibition, pharmacophore modeling, and interaction with opioid receptors. Bioorg Med Chem18:5071-80 (2010) 
 
Kappa-type opioid receptor
Name:Kappa-type opioid receptor
Type:G Protein-Coupled Receptor (GPCR)
Mol. Mass.:42744.99
Organism:Cavia porcellus (domestic guinea pig)
Description:P41144
Residue:380
BDBM50326658
NameBDBM50326658
Synonyms:CHEMBL1253928
TypeSmall organic molecule
Emp. Form.C19H25NO3
Mol. Mass.315.4067
SMILESCCO[C@@]12CCC(=O)C[C@@]11CCN(C)[C@@H]2Cc2cccc(O)c12