Reaction Details
TargetNeuraminidase
LigandBDBM4994
Substrate/Competitorn/a
Meas. Tech.ChEMBL_679996 (CHEMBL1280944)
IC50 1.6±n/a nM
Citation Hata, KKoseki, KYamaguchi, KMoriya, SSuzuki, YYingsakmongkon, SHirai, GSodeoka, Mvon Itzstein, MMiyagi, T Limited inhibitory effects of oseltamivir and zanamivir on human sialidases. Antimicrob Agents Chemother52:3484-91 (2008) 
 
Neuraminidase
Name:Neuraminidase
Type:PROTEIN
Mol. Mass.:52187.20
Organism:Influenza A virus (strain A/Aichi/2/1968 H3N2)
Description:ChEMBL_679996
Residue:469
BDBM4994
NameBDBM4994
Synonyms:(3R,4R,5S)-5-amino-4-acetamido-3-(pentan-3-yloxy)cyclohex-1-ene-1-carboxylic acid GS4071 | Oseltamivir carboxylate
TypeSmall organic molecule
Emp. Form.C14H24N2O4
Mol. Mass.284.3514
SMILESCCC(CC)O[C@@H]1C=C(C[C@H](N)[C@H]1NC(C)=O)C(O)=O