Reaction Details
Target5-hydroxytryptamine receptor 1A
LigandBDBM50330462
Substrate/Competitorn/a
Meas. Tech.ChEMBL_684850 (CHEMBL1286080)
IC50>100±n/a nM
Citation Asagarasu, AMatsui, THayashi, HTamaoki, SYamauchi, YMinato, KSato, M Discovery of a novel 5-HT(3) antagonist/5-HT(1A) agonist 3-amino-5,6,7,8-tetrahydro-2-{4-[4-(quinolin-2-yl)piperazin-1-yl]butyl}quinazolin-4(3H)-one (TZB-30878) as an orally bioavailable agent for irritable bowel syndrome. J Med Chem53:7549-63 (2010) 
 
5-hydroxytryptamine receptor 1A
Name:5-hydroxytryptamine receptor 1A
Type:n/a
Mol. Mass.:46122.49
Organism:Homo sapiens (Human)
Description:n/a
Residue:422
BDBM50330462
NameBDBM50330462
Synonyms:2-[3-(4-Quinolin-2-ylpiperazin-1-yl)propylthio]-5,6,7,8-tetrahydro-3H-benzo[4,5]thieno[2,3-d]pyrimidin-4-one | CHEMBL1277187
TypeSmall organic molecule
Emp. Form.C26H29N5OS2
Mol. Mass.491.671
SMILESO=c1[nH]c(SCCCN2CCN(CC2)c2ccc3ccccc3n2)nc2sc3CCCCc3c12